Target
ATPase family AAA domain-containing protein 2
Ligand
BDBM50514870
Substrate
Meas. Tech.
ChEMBL_1858860 (CHEMBL4359589)
IC50
251±n/a nM
Citation
 Lucas, SCCAtkinson, SJBamborough, PBarnett, HChung, CWGordon, LMitchell, DJPhillipou, APrinjha, RKSheppard, RJTomkinson, NCOWatson, RJDemont, EH Optimization of Potent ATAD2 and CECR2 Bromodomain Inhibitors with an Atypical Binding Mode. J Med Chem 63:5212-5241 (2020)  
Target
Name:
ATPase family AAA domain-containing protein 2
Synonyms:
AAA nuclear coregulator cancer-associated protein ATAD2 PRO2000
Type:
PROTEIN
Mol. Mass.:
158546.30
Organism:
Homo sapiens (Human)
Description:
ChEMBL_1500426
Residue:
1390
  
Inhibitor
Name:
BDBM50514870
Synonyms:
CHEMBL4565203
Type:
Small organic molecule
Emp. Form.:
C19H23BrN4O5S
Mol. Mass.:
499.379
SMILES:
C[C@]1(NC(=O)N(CC(=O)Nc2ccc(Br)c(c2)S(=O)(=O)N2CCCC2)C1=O)C1CC1
: