Target
ATPase family AAA domain-containing protein 2
Ligand
BDBM50514885
Substrate
Meas. Tech.
ChEMBL_1858860 (CHEMBL4359589)
IC50
100±n/a nM
Citation
 Lucas, SCCAtkinson, SJBamborough, PBarnett, HChung, CWGordon, LMitchell, DJPhillipou, APrinjha, RKSheppard, RJTomkinson, NCOWatson, RJDemont, EH Optimization of Potent ATAD2 and CECR2 Bromodomain Inhibitors with an Atypical Binding Mode. J Med Chem 63:5212-5241 (2020)  
Target
Name:
ATPase family AAA domain-containing protein 2
Synonyms:
AAA nuclear coregulator cancer-associated protein ATAD2 PRO2000
Type:
PROTEIN
Mol. Mass.:
158546.30
Organism:
Homo sapiens (Human)
Description:
ChEMBL_1500426
Residue:
1390
  
Inhibitor
Name:
BDBM50514885
Synonyms:
CHEMBL4589592
Type:
Small organic molecule
Emp. Form.:
C20H25BrN4O5S
Mol. Mass.:
513.405
SMILES:
C[C@H]1CCN(C1)S(=O)(=O)c1cc(NC(=O)CN2C(=O)N[C@](C)(C3CC3)C2=O)ccc1Br
: