Target
5-hydroxytryptamine receptor 1A
Ligand
BDBM50070188
Substrate
Meas. Tech.
ChEBML_842
IC50
210±n/a nM
Citation
 Mantegani, SBrambilla, ECaccia, CDamiani, GFornaretto, MGMcArthur, RAVarasi, M Serotonergic ergoline derivatives. Bioorg Med Chem Lett 8:1117-22 (1999)  
Target
Name:
5-hydroxytryptamine receptor 1A
Synonyms:
5-HT-1A 5-HT1A 5-hydroxytryptamine receptor 1A (5HT1A) 5ht1a Htr1a Serotonin 1a (5-HT1a) receptor/Adrenergic receptor alpha-1 | Serotonin receptor 1A
Type:
G Protein-Coupled Receptor (GPCR)
Mol. Mass.:
46445.29
Organism:
Rattus norvegicus (rat)
Description:
Binding assays were performed using rat hippocampal membranes.
Residue:
422
  
Inhibitor
Name:
BDBM50070188
Synonyms:
1-((6aR,9R,10aR)-3-tert-Butyl-7-methyl-4,6,6a,7,8,9,10,10a-octahydro-indolo[4,3-fg]quinoline-9-carbonyl)-1-(3-dimethylamino-propyl)-3-ethyl-urea | CHEMBL13805
Type:
Small organic molecule
Emp. Form.:
C28H43N5O2
Mol. Mass.:
481.6733
SMILES:
CCNC(=O)N(CCCN(C)C)C(=O)[C@@H]1C[C@H]2[C@@H](Cc3c[nH]c4c(ccc2c34)C(C)(C)C)N(C)C1
: