Target
Glutamate receptor ionotropic, NMDA 1/2A
Ligand
BDBM50062599
Substrate
Meas. Tech.
ChEMBL_1860844 (CHEMBL4361700)
IC50
2300±n/a nM
Citation
 Rosini, MSimoni, ECaporaso, RBasagni, FCatanzaro, MAbu, IFFagiani, FFusco, FMasuzzo, SAlbani, DLanni, CMellor, IRMinarini, A Merging memantine and ferulic acid to probe connections between NMDA receptors, oxidative stress and amyloid-? peptide in Alzheimer's disease. Eur J Med Chem 180:111-120 (2019)  
Target
Name:
Glutamate receptor ionotropic, NMDA 1/2A
Synonyms:
Glutamate NMDA receptor; GRIN1/GRIN2A NR1/NR2A
Type:
Protein
Mol. Mass.:
Description:
Components:
This complex has 2 components.
Component 1
Name:
Glutamate receptor ionotropic, NMDA 1
Synonyms:
GRIN1 Glutamate [NMDA] receptor subunit zeta-1 N-methyl-D-aspartate receptor subunit NR1 NMDZ1_HUMAN | phencyclidine
Type:
Enzyme Catalytic Domain
Mol. Mass.:
105397.81
Organism:
Homo sapiens (Human)
Description:
Q05586
Residue:
938
  
Component 2
Name:
Glutamate receptor ionotropic, NMDA 2A
Synonyms:
GRIN2A Glutamate [NMDA] receptor Glutamate [NMDA] receptor subunit epsilon-1 NMDA receptor subtype 2A protein (NR2A) NMDE1_HUMAN hNR2A
Type:
Mol. Mass.:
165293.76
Organism:
Homo sapiens (Human)
Description:
Residue:
1464
  
Inhibitor
Name:
BDBM50062599
Synonyms:
3,5-Dimethyl-adamantan-1-ylamine EN300-123026 Namenda | US10214478, Compound memantine
Type:
Small organic molecule
Emp. Form.:
C12H21N
Mol. Mass.:
179.3018
SMILES:
CC12CC3CC(C)(C1)CC(N)(C3)C2
: