Target
Estradiol 17-beta-dehydrogenase 2
Ligand
BDBM50515436
Substrate
Meas. Tech.
ChEMBL_1861100 (CHEMBL4361956)
IC50
46±n/a nM
Citation
 Abdelsamie, ASSalah, MSiebenbürger, LMerabet, AScheuer, CFrotscher, MMüller, STZierau, OVollmer, GMenger, MDLaschke, MWvan Koppen, CJMarchais-Oberwinkler, SHartmann, RW Design, Synthesis, and Biological Characterization of Orally Active 17?-Hydroxysteroid Dehydrogenase Type 2 Inhibitors Targeting the Prevention of Osteoporosis. J Med Chem 62:7289-7301 (2019)  
Target
Name:
Estradiol 17-beta-dehydrogenase 2
Synonyms:
17-beta-HSD 2 DHB2_MOUSE Hsd17b2 | Testosterone 17-beta-dehydrogenase
Type:
PROTEIN
Mol. Mass.:
41847.95
Organism:
Mus musculus
Description:
ChEMBL_104366
Residue:
381
  
Inhibitor
Name:
BDBM50515436
Synonyms:
CHEMBL4441313
Type:
Small organic molecule
Emp. Form.:
C22H12ClF3N2O4S2
Mol. Mass.:
524.92
SMILES:
Oc1c(F)c(F)cc(C(=O)c2ccc(s2)-c2ccccc2NS(=O)(=O)c2ccc(Cl)nc2)c1F
: