Target
Bromodomain-containing protein 3
Ligand
BDBM50515771
Substrate
Meas. Tech.
ChEMBL_1862507 (CHEMBL4363363)
Ki
5.3±n/a nM
Citation
 Chen, DLu, TYan, ZLu, WZhou, FLyu, XXu, BJiang, HChen, KLuo, CZhao, Y Discovery, structural insight, and bioactivities of BY27 as a selective inhibitor of the second bromodomains of BET proteins. Eur J Med Chem 182:0 (2019)  
Target
Name:
Bromodomain-containing protein 3
Synonyms:
BRD3 Bromodomain and extra-terminal motif (BET) Bromodomain-containing protein 3 (BRD3) RING3-like protein | RING3L
Type:
Protein
Mol. Mass.:
79571.81
Organism:
Homo sapiens (Human)
Description:
Q15059
Residue:
726
  
Inhibitor
Name:
BDBM50515771
Synonyms:
CHEMBL4528047
Type:
Small organic molecule
Emp. Form.:
C22H21ClN6
Mol. Mass.:
404.895
SMILES:
Cc1nnc2CC[C@@H](Nc3ccc(Cl)cc3)c3cc(ccc3-n12)-c1cnn(C)c1
: