Target
Chromobox protein homolog 7
Ligand
BDBM50515882
Substrate
Meas. Tech.
ChEMBL_1862780 (CHEMBL4363636)
Kd
8800±n/a nM
Citation
 Yang, LLiu, YFan, MZhu, GJin, HLiang, JLiu, ZHuang, ZZhang, L Identification and characterization of benzo[d]oxazol-2(3H)-one derivatives as the first potent and selective small-molecule inhibitors of chromodomain protein CDYL. Eur J Med Chem 182:0 (2019)  
Target
Name:
Chromobox protein homolog 7
Synonyms:
CBX7 Chromobox protein homolog 7 | Chromobox protein homolog 7 (CBX7)
Type:
Protein
Mol. Mass.:
28351.76
Organism:
Homo sapiens (Human)
Description:
Residue:
251
  
Inhibitor
Name:
BDBM50515882
Synonyms:
CHEMBL4582102
Type:
Small organic molecule
Emp. Form.:
C17H11N3O4S
Mol. Mass.:
353.352
SMILES:
[O-][N+](=O)c1ccc2n(CC(=O)c3c[nH]c4ccccc34)c(=O)sc2c1
: