Target
Chromobox protein homolog 7
Ligand
BDBM50515896
Substrate
Meas. Tech.
ChEMBL_1862780 (CHEMBL4363636)
Kd
13500±n/a nM
Citation
 Yang, LLiu, YFan, MZhu, GJin, HLiang, JLiu, ZHuang, ZZhang, L Identification and characterization of benzo[d]oxazol-2(3H)-one derivatives as the first potent and selective small-molecule inhibitors of chromodomain protein CDYL. Eur J Med Chem 182:0 (2019)  
Target
Name:
Chromobox protein homolog 7
Synonyms:
CBX7 Chromobox protein homolog 7 | Chromobox protein homolog 7 (CBX7)
Type:
Protein
Mol. Mass.:
28351.76
Organism:
Homo sapiens (Human)
Description:
Residue:
251
  
Inhibitor
Name:
BDBM50515896
Synonyms:
CHEMBL4450033
Type:
Small organic molecule
Emp. Form.:
C19H25N3O3
Mol. Mass.:
343.4201
SMILES:
O=C(Cn1c2ccccc2oc1=O)N1CCC(CC1)N1CCCCC1
: