Target
17-beta-hydroxysteroid dehydrogenase type 1
Ligand
BDBM50466012
Substrate
Meas. Tech.
ChEMBL_1863752 (CHEMBL4364727)
IC50
1.5±n/a nM
Citation
 Abdelsamie, ASSalah, MSiebenbürger, LHamed, MMBörger, Cvan Koppen, CJFrotscher, MHartmann, RW Development of potential preclinical candidates with promising in vitro ADME profile for the inhibition of type 1 and type 2 17?-Hydroxysteroid dehydrogenases: Design, synthesis, and biological evaluation. Eur J Med Chem 178:93-107 (2019)  
Target
Name:
17-beta-hydroxysteroid dehydrogenase type 1
Synonyms:
17-beta-HSD 1 17-beta-hydroxysteroid dehydrogenase type 1 20-alpha-HSD E17KSR EDH17B1 EDHB17 Estradiol 17-beta-dehydrogenase 1 (17beta-HSD1) Placental 17-beta-hydroxysteroid dehydrogenase | SDR28C1
Type:
Enzyme
Mol. Mass.:
34945.13
Organism:
Homo sapiens (Human)
Description:
P14061
Residue:
328
  
Inhibitor
Name:
BDBM50466012
Synonyms:
CHEMBL4287575
Type:
Small organic molecule
Emp. Form.:
C19H10F3NO2S
Mol. Mass.:
373.348
SMILES:
Oc1c(F)c(F)cc(C(=O)c2ccc(s2)-c2cccc3[nH]ccc23)c1F
: