Target
Cereblon isoform 4
Ligand
BDBM50070114
Substrate
Meas. Tech.
ChEMBL_1866003 (CHEMBL4366978)
Ki
4400±n/a nM
Citation
 Heim, CPliatsika, DMousavizadeh, FBär, KHernandez Alvarez, BGiannis, AHartmann, MD De-Novo Design of Cereblon (CRBN) Effectors Guided by Natural Hydrolysis Products of Thalidomide Derivatives. J Med Chem 62:6615-6629 (2019)  
Target
Name:
Cereblon isoform 4
Synonyms:
Cereblon isoform 4
Type:
PROTEIN
Mol. Mass.:
13620.40
Organism:
Magnetospirillum gryphiswaldense
Description:
ChEMBL_116733
Residue:
124
  
Inhibitor
Name:
BDBM50070114
Synonyms:
(+/-)-thalidomide 2-(2,6-dioxopiperidin-3-yl)isoindoline-1,3-dione K-17 Thalomid [(R,S)-2-(2,6-dioxo-3-piperidinyl)-1H-isoindole-1,3(2H)-dione
Type:
Small organic molecule
Emp. Form.:
C13H10N2O4
Mol. Mass.:
258.2295
SMILES:
O=C1N(C2CCC(=O)NC2=O)C(=O)c2ccccc12
: