Target
Dipeptidyl peptidase 4
Ligand
BDBM50516930
Substrate
Meas. Tech.
ChEMBL_1867118 (CHEMBL4368093)
IC50
0.100000±n/a nM
Citation
 Li, QMeng, LZhou, SDeng, XWang, NJi, YPeng, YXing, JYao, G Rapid generation of novel benzoic acid-based xanthine derivatives as highly potent, selective and long acting DPP-4 inhibitors: Scaffold-hopping and prodrug study. Eur J Med Chem 180:509-523 (2019)  
Target
Name:
Dipeptidyl peptidase 4
Synonyms:
ADABP Adenosine deaminase complexing protein 2 CD_antigen=CD26 DPP4 DPPIV Dipeptidyl peptidase 4 (DPP IV) Dipeptidyl peptidase 4 (DPP4) Dipeptidyl peptidase 4 membrane form Dipeptidyl peptidase IV Dipeptidyl peptidase IV (DDP-IV) Dipeptidyl peptidase IV membrane form Dipeptidyl peptidase-IV (DPP-4) T-cell activation antigen CD26 | TP103
Type:
Enzyme
Mol. Mass.:
88271.01
Organism:
Homo sapiens (Human)
Description:
P27487
Residue:
766
  
Inhibitor
Name:
BDBM50516930
Synonyms:
CHEMBL4448186
Type:
Small organic molecule
Emp. Form.:
C23H25ClN6O4
Mol. Mass.:
484.935
SMILES:
CC#CCn1c(nc2n(C)c(=O)n(Cc3ccc(Cl)cc3C(O)=O)c(=O)c12)N1CCC[C@@H](N)C1
: