Target
Adenosine receptor A1
Ligand
BDBM50517302
Substrate
Meas. Tech.
ChEMBL_1868856 (CHEMBL4369922)
Ki
0.200000±n/a nM
Citation
 Tosh, DKRao, HBitant, ASalmaso, VMannes, PLieberman, DIVaughan, KLMattison, JARothwell, ACAuchampach, JACiancetta, ALiu, NCui, ZGao, ZGReitman, MLGavrilova, OJacobson, KA Design and in Vivo Characterization of A J Med Chem 62:1502-1522 (2019)  
Target
Name:
Adenosine receptor A1
Synonyms:
AA1R_MOUSE Adenosine receptor A1 | Adora1
Type:
PROTEIN
Mol. Mass.:
36646.06
Organism:
Mus musculus
Description:
ChEMBL_479902
Residue:
326
  
Inhibitor
Name:
BDBM50517302
Synonyms:
CHEMBL4562258
Type:
Small organic molecule
Emp. Form.:
C17H22ClN5O3
Mol. Mass.:
379.841
SMILES:
[H][C@]12CC[C@]([H])(C1)C(C2)Nc1ncnc2n(cnc12)[C@@H]1O[C@H](CCl)[C@@H](O)[C@H]1O
: