Target
Estrogen receptor
Ligand
BDBM50517551
Substrate
Meas. Tech.
ChEMBL_1869253 (CHEMBL4370319)
IC50
0.398107±n/a nM
Citation
 Scott, JSBailey, AButtar, DCarbajo, RJCurwen, JDavey, PRJDavies, RDMDegorce, SLDonald, CGangl, EGreenwood, RGroombridge, SDJohnson, TLamont, SLawson, MLister, AMorrow, CJMoss, TAPink, JHPolanski, R Tricyclic Indazoles-A Novel Class of Selective Estrogen Receptor Degrader Antagonists. J Med Chem 62:1593-1608 (2019)  
Target
Name:
Estrogen receptor
Synonyms:
ER ESR ESR1_HUMAN Estrogen receptor Estrogen receptor (ER-alpha) Estrogen receptor alpha (ER) Nuclear receptor subfamily 3 group A member 1
Type:
Protein
Mol. Mass.:
66230.44
Organism:
Homo sapiens (Human)
Description:
P03372
Residue:
595
  
Inhibitor
Name:
BDBM50517551
Synonyms:
CHEMBL4436187
Type:
Small organic molecule
Emp. Form.:
C23H21F4N3O2
Mol. Mass.:
447.4254
SMILES:
C[C@@H]1Cc2c(ccc3[nH]ncc23)[C@H](N1CC(C)(F)F)c1c(F)cc(\C=C\C(O)=O)cc1F
: