Target
Estrogen receptor
Ligand
BDBM50517560
Substrate
Meas. Tech.
ChEMBL_1869253 (CHEMBL4370319)
IC50
0.316228±n/a nM
Citation
 Scott, JSBailey, AButtar, DCarbajo, RJCurwen, JDavey, PRJDavies, RDMDegorce, SLDonald, CGangl, EGreenwood, RGroombridge, SDJohnson, TLamont, SLawson, MLister, AMorrow, CJMoss, TAPink, JHPolanski, R Tricyclic Indazoles-A Novel Class of Selective Estrogen Receptor Degrader Antagonists. J Med Chem 62:1593-1608 (2019)  
Target
Name:
Estrogen receptor
Synonyms:
ER ESR ESR1_HUMAN Estrogen receptor Estrogen receptor (ER-alpha) Estrogen receptor alpha (ER) Nuclear receptor subfamily 3 group A member 1
Type:
Protein
Mol. Mass.:
66230.44
Organism:
Homo sapiens (Human)
Description:
P03372
Residue:
595
  
Inhibitor
Name:
BDBM50517560
Synonyms:
CHEMBL4583286
Type:
Small organic molecule
Emp. Form.:
C24H24F3N3O3
Mol. Mass.:
459.4609
SMILES:
COc1cc(\C=C\C(O)=O)cc(F)c1[C@H]1N(CC(C)(F)F)[C@H](C)Cc2c1ccc1[nH]ncc21
: