Target
Estrogen receptor
Ligand
BDBM288677
Substrate
Meas. Tech.
ChEMBL_1869284 (CHEMBL4370350)
IC50
1.000000±n/a nM
Citation
 Scott, JSBailey, AButtar, DCarbajo, RJCurwen, JDavey, PRJDavies, RDMDegorce, SLDonald, CGangl, EGreenwood, RGroombridge, SDJohnson, TLamont, SLawson, MLister, AMorrow, CJMoss, TAPink, JHPolanski, R Tricyclic Indazoles-A Novel Class of Selective Estrogen Receptor Degrader Antagonists. J Med Chem 62:1593-1608 (2019)  
Target
Name:
Estrogen receptor
Synonyms:
ER ESR ESR1_HUMAN Estrogen receptor Estrogen receptor (ER-alpha) Estrogen receptor alpha (ER) Nuclear receptor subfamily 3 group A member 1
Type:
Protein
Mol. Mass.:
66230.44
Organism:
Homo sapiens (Human)
Description:
P03372
Residue:
595
  
Inhibitor
Name:
BDBM288677
Synonyms:
US10087191, Example 94
Type:
Small organic molecule
Emp. Form.:
C24H24F3N3O2
Mol. Mass.:
443.4615
SMILES:
C[C@@H]1Cc2c(ccc3[nH]ncc23)[C@H](N1CC(C)(C)F)c1c(F)cc(\C=C\C(O)=O)cc1F
: