Target
Proteasome subunit beta type-2
Ligand
BDBM50517649
Substrate
Meas. Tech.
ChEMBL_1869379 (CHEMBL4370445)
IC50
32±n/a nM
Citation
 Xin, BTHuber, EMde Bruin, GHeinemeyer, WMaurits, EEspinal, CDu, YJanssens, MWeyburne, ESKisselev, AFFlorea, BIDriessen, Cvan der Marel, GAGroll, MOverkleeft, HS Structure-Based Design of Inhibitors Selective for Human Proteasome ?2c or ?2i Subunits. J Med Chem 62:1626-1642 (2019)  
Target
Name:
Proteasome subunit beta type-2
Synonyms:
20S proteasome PSMB2 | Proteasome Macropain subunit
Type:
PROTEIN
Mol. Mass.:
22837.53
Organism:
Homo sapiens (Human)
Description:
ChEMBL_1294233
Residue:
201
  
Inhibitor
Name:
BDBM50517649
Synonyms:
CHEMBL4457630
Type:
Small organic molecule
Emp. Form.:
C30H49N5O6S
Mol. Mass.:
607.805
SMILES:
CC(C)C[C@H](NC(=O)CN1CCOCC1)C(=O)N[C@@H](CC(C)C)C(=O)N[C@@H](Cc1ccc(CN)cc1)\C=C\S(C)(=O)=O
: