Target
Amine oxidase [flavin-containing] B
Ligand
BDBM50240772
Substrate
Meas. Tech.
ChEMBL_1869475 (CHEMBL4370541)
IC50
560±n/a nM
Citation
 Wang, XSu, MLi, YLiu, TWang, YChen, YTang, LHe, YPDing, XYu, FShen, JLi, JZhou, YChen, YLXiong, B Tranylcypromine and 6-trifluoroethyl thienopyrimidine hybrid as LSD1 inhibitor. Bioorg Med Chem Lett 29:844-847 (2019)  
Target
Name:
Amine oxidase [flavin-containing] B
Synonyms:
AOFB_HUMAN MAOB Monoamine oxidase type B (MAO B) Monoamine oxidase type B (MAOB)
Type:
Protein
Mol. Mass.:
58768.76
Organism:
Homo sapiens (Human)
Description:
P27338
Residue:
520
  
Inhibitor
Name:
BDBM50240772
Synonyms:
(1R,2S)-(-)-2-phenylcyclopropylamine (tranylcypromine)2-Phenyl-cyclopropylamine CHEMBL1179 TRANYLCYPROMINE US10836743, Compound TCP US9180183, Tranylcypromine rel-Tranylcypromine
Type:
Small organic molecule
Emp. Form.:
C9H11N
Mol. Mass.:
133.1903
SMILES:
N[C@@H]1C[C@H]1c1ccccc1
: