Target
Mu-type opioid receptor
Ligand
BDBM50008984
Substrate
Meas. Tech.
ChEMBL_1870360 (CHEMBL4371527)
EC50
53±n/a nM
Citation
 Tan, LYan, WMcCorvy, JDCheng, J Biased Ligands of G Protein-Coupled Receptors (GPCRs): Structure-Functional Selectivity Relationships (SFSRs) and Therapeutic Potential. J Med Chem 61:9841-9878 (2018)  
Target
Name:
Mu-type opioid receptor
Synonyms:
M-OR-1 MOR-1 MUOR1 Mu opiate receptor OPRM1 hMOP | mu-type opioid receptor isoform MOR-1
Type:
G Protein-Coupled Receptor (GPCR)
Mol. Mass.:
44789.51
Organism:
Homo sapiens (Human)
Description:
P35372
Residue:
400
  
Inhibitor
Name:
BDBM50008984
Synonyms:
4-(4-Chloro-benzyl)-2-(1-methyl-azepan-4-yl)-2H-phthalazin-1-one Duragesic-100 Duragesic-25 Duragesic-75 FENTANYL CITRATE Fentanyl-100 Fentanyl-25 Fentanyl-75 Innovar N-(1-Phenethyl-piperidin-4-yl)-N-phenyl-propionamide N-(1-phenethylpiperidin-4-yl)-N-phenylpropionamide | US20230399418, Compound Fentanyl
Type:
Small organic molecule
Emp. Form.:
C22H28N2O
Mol. Mass.:
336.4705
SMILES:
CCC(=O)N(C1CCN(CCc2ccccc2)CC1)c1ccccc1
: