Target
Alpha-1,6-mannosyl-glycoprotein 2-beta-N-acetylglucosaminyltransferase
Ligand
BDBM50518064
Substrate
Meas. Tech.
ChEMBL_1870514 (CHEMBL4371681)
IC50
0.640000±n/a nM
Citation
 Devasthale, PCheng, D Monoacylglycerol Acyltransferase 2 (MGAT2) Inhibitors for the Treatment of Metabolic Diseases and Nonalcoholic Steatohepatitis (NASH). J Med Chem 61:9879-9888 (2018)  
Target
Name:
Alpha-1,6-mannosyl-glycoprotein 2-beta-N-acetylglucosaminyltransferase
Synonyms:
2.4.1.143 GNT-II MGAT2 Mannoside acetylglucosaminyltransferase 2 Monoacylglycerol acyltransferase type 2 (h-MGAT2) h-MGAT2 (human monoacylglycerol acyltransferase type 2)
Type:
Mol. Mass.:
51567.80
Organism:
Homo sapiens (Human)
Description:
Q10469
Residue:
447
  
Inhibitor
Name:
BDBM50518064
Synonyms:
CHEMBL4463750
Type:
Small organic molecule
Emp. Form.:
C31H35F3N4O3S
Mol. Mass.:
600.695
SMILES:
FC(F)(F)c1ccc(OCCCCCNCC(=O)N2CCc3nc(SC4CCC4)n(-c4ccccc4)c(=O)c3C2)cc1
: