Target
Chymotrypsinogen A
Ligand
BDBM50073127
Substrate
Meas. Tech.
ChEMBL_34109 (CHEMBL649738)
Ki
70.0±n/a nM
Citation
 Iijima, KKatada, JYasuda, EUno, IHayashi, Y N-[2,2-dimethyl-3-(N-(4-cyanobenzoyl)amino)nonanoyl]-L-phenylalanine ethyl ester as a stable ester-type inhibitor of chymotrypsin-like serine proteases: structural requirements for potent inhibition of alpha-chymotrypsin. J Med Chem 42:312-23 (1999)  
Target
Name:
Chymotrypsinogen A
Synonyms:
Alpha-chymotrypsin Chymotrypsin A Chymotrypsin A chain B Chymotrypsinogen A | alpha-Chymotrypsin (α-Chymotrypsin)
Type:
Serine protease
Mol. Mass.:
25670.88
Organism:
Bos taurus (bovine)
Description:
Residue:
245
  
Inhibitor
Name:
BDBM50073127
Synonyms:
(S)-2-[3-(4-Cyano-benzoylamino)-2,2-dimethyl-nonanoylamino]-3-phenyl-propionic acid isopropyl ester | CHEMBL111705
Type:
Small organic molecule
Emp. Form.:
C31H41N3O4
Mol. Mass.:
519.6749
SMILES:
CCCCCCC(NC(=O)c1ccc(cc1)C#N)C(C)(C)C(=O)N[C@@H](Cc1ccccc1)C(=O)OC(C)C
: