Target
N-lysine methyltransferase SMYD2
Ligand
BDBM50519300
Substrate
Meas. Tech.
ChEMBL_1874852 (CHEMBL4376141)
IC50
8.0±n/a nM
Citation
 Taylor, APSwewczyk, MKennedy, STrush, VVWu, HZeng, HDong, AFerreira de Freitas, RTatlock, JKumpf, RAWythes, MCasimiro-Garcia, ADenny, RAParikh, MDLi, FBarsyte-Lovejoy, DSchapira, MVedadi, MBrown, PJArrowsmith, CHOwen, DR Selective, Small-Molecule Co-Factor Binding Site Inhibition of a Su(var)3-9, Enhancer of Zeste, Trithorax Domain Containing Lysine Methyltransferase. J Med Chem 62:7669-7683 (2019)  
Target
Name:
N-lysine methyltransferase SMYD2
Synonyms:
HSKM-B KMT3C N-lysine methyltransferase SMYD2 SET and MYND domain-containing protein 2 (SMYD2) SMYD2_HUMAN
Type:
Enzyme
Mol. Mass.:
49689.57
Organism:
Homo sapiens (Human)
Description:
Q9NRG4
Residue:
433
  
Inhibitor
Name:
BDBM50519300
Synonyms:
CHEMBL4520134
Type:
Small organic molecule
Emp. Form.:
C29H39N7O
Mol. Mass.:
501.6663
SMILES:
Cc1cc2n(cnc2c(N)n1)C1(C)CN(C1)C(=O)c1ccn(CC2CCN(CC2)[C@@H]2CCCCC=C2)c1
: