Target
Diacylglycerol lipase-alpha
Ligand
BDBM50211236
Substrate
Meas. Tech.
ChEMBL_1874961 (CHEMBL4376250)
IC50
>1.000000±n/a nM
Citation
 Janssen, APAvan Hengst, JMABéquignon, OJMDeng, Hvan Westen, GJPvan der Stelt, M Structure Kinetics Relationships and Molecular Dynamics Show Crucial Role for Heterocycle Leaving Group in Irreversible Diacylglycerol Lipase Inhibitors. J Med Chem 62:7910-7922 (2019)  
Target
Name:
Diacylglycerol lipase-alpha
Synonyms:
DGL-alpha Dagla Neural stem cell-derived dendrite regulator Sn1-specific diacylglycerol lipase alpha
Type:
PROTEIN
Mol. Mass.:
115371.22
Organism:
Mus musculus
Description:
ChEMBL_101098
Residue:
1044
  
Inhibitor
Name:
BDBM50211236
Synonyms:
CHEMBL2144065
Type:
Small organic molecule
Emp. Form.:
C27H26N4O
Mol. Mass.:
422.5215
SMILES:
O=C(N1CCCCC1Cc1ccccc1)n1cc(nn1)-c1ccc(cc1)-c1ccccc1
: