Target
Potassium-transporting ATPase subunit beta
Ligand
BDBM50073331
Substrate
Meas. Tech.
ChEBML_29657
IC50
663±n/a nM
Citation
 Nadler, GMorvan, MDelimoge, IBelfiore, PZocchetti, AJames, IZembryki, DLee-Rycakzewski, EParini, CConsolandi, EGagliardi, SFarina, C (2Z,4E)-5-(5,6-dichloro-2-indolyl)-2-methoxy-N-(1,2,2,6,6- pentamethylpiperidin-4-yl)-2,4-pentadienamide, a novel, potent and selective inhibitor of the osteoclast V-ATPase. Bioorg Med Chem Lett 8:3621-6 (1999)  
Target
Name:
Potassium-transporting ATPase subunit beta
Synonyms:
ATP4B Gastric H(+)/K(+) ATPase subunit beta Potassium-transporting ATPase beta chain Proton pump beta chain | gp60-90
Type:
Mol. Mass.:
33083.09
Organism:
Sus scrofa (Pig)
Description:
Residue:
290
  
Inhibitor
Name:
BDBM50073331
Synonyms:
(2Z,4Z)-5-(5,6-Dichloro-1H-indol-2-yl)-2-methoxy-penta-2,4-dienoic acid (1,2,2,6,6-pentamethyl-piperidin-4-yl)-amide TCMDC-139106
Type:
Small organic molecule
Emp. Form.:
C24H31Cl2N3O2
Mol. Mass.:
464.428
SMILES:
CO\C(=C/C=C\c1cc2cc(Cl)c(Cl)cc2[nH]1)C(=O)NC1CC(C)(C)N(C)C(C)(C)C1
: