Target
Leukotriene C4 synthase
Ligand
BDBM50519569
Substrate
Meas. Tech.
ChEMBL_1876790 (CHEMBL4378184)
IC50
14±n/a nM
Target
Name:
Leukotriene C4 synthase
Synonyms:
LTC4 synthase LTC4S_HUMAN | Leukotriene-C(4) synthase
Type:
PROTEIN
Mol. Mass.:
16575.59
Organism:
Homo sapiens (Human)
Description:
ChEMBL_961179
Residue:
150
  
Inhibitor
Name:
BDBM50519569
Synonyms:
CHEMBL4545950
Type:
Small organic molecule
Emp. Form.:
C22H20F4N2O4
Mol. Mass.:
452.3988
SMILES:
COc1cc(cnc1C(=O)[C@H]1C[C@@H]1C(O)=O)N(CC1CC1)c1cc(ccc1F)C(F)(F)F
: