Target
Leukotriene C4 synthase
Ligand
BDBM223288
Substrate
Meas. Tech.
ChEMBL_1876789 (CHEMBL4378183)
IC50
0.250000±n/a nM
Target
Name:
Leukotriene C4 synthase
Synonyms:
LTC4 synthase LTC4S_HUMAN | Leukotriene-C(4) synthase
Type:
PROTEIN
Mol. Mass.:
16575.59
Organism:
Homo sapiens (Human)
Description:
ChEMBL_961179
Residue:
150
  
Inhibitor
Name:
BDBM223288
Synonyms:
(1S,2S)-2-[(5-{(2-Fluoro-2-methylpropyl)[2-fluoro-5-(trifluoromethyl)phenyl]amino}-3-methoxypyrazin-2-yl)carbonyl]cyclopropanecarboxylic acid US9657001, 63
Type:
Small Organic Molecule
Emp. Form.:
C21H20F5N3O4
Mol. Mass.:
473.3932
SMILES:
COc1nc(cnc1C(=O)[C@H]1C[C@@H]1C(O)=O)N(CC(C)(C)F)c1cc(ccc1F)C(F)(F)F
: