Target
Leukotriene C4 synthase
Ligand
BDBM223290
Substrate
Meas. Tech.
ChEMBL_1876790 (CHEMBL4378184)
IC50
6.8±n/a nM
Target
Name:
Leukotriene C4 synthase
Synonyms:
LTC4 synthase LTC4S_HUMAN | Leukotriene-C(4) synthase
Type:
PROTEIN
Mol. Mass.:
16575.59
Organism:
Homo sapiens (Human)
Description:
ChEMBL_961179
Residue:
150
  
Inhibitor
Name:
BDBM223290
Synonyms:
(1S,2S)-2-[(5-{[2-Fluoro-5-(trifluoromethyl)phenyl](2-methylpropyl)amino}-3-methoxypyridin-2-yl)carbonyl]cyclopropanecarboxylic acid US9657001, 65
Type:
Small Organic Molecule
Emp. Form.:
C22H22F4N2O4
Mol. Mass.:
454.4147
SMILES:
COc1cc(cnc1C(=O)[C@H]1C[C@@H]1C(O)=O)N(CC(C)C)c1cc(ccc1F)C(F)(F)F
: