Target
Receptor-type tyrosine-protein kinase FLT3
Ligand
BDBM50519725
Substrate
Meas. Tech.
ChEMBL_1878251 (CHEMBL4379645)
IC50
0.100000±n/a nM
Citation
 Lin, WHWu, SYYeh, TKChen, CTSong, JSShiao, HYKuo, CCHsu, TLu, CTWang, PCWu, TSPeng, YHLin, HYChen, CPWeng, YLKung, FCWu, MHSu, YCHuang, KWChou, LHHsueh, CCYen, KJKuo, PCHuang, CLChen, LTShih, CTsai, HJJiaang, WT Identification of a Multitargeted Tyrosine Kinase Inhibitor for the Treatment of Gastrointestinal Stromal Tumors and Acute Myeloid Leukemia. J Med Chem 62:11135-11150 (2019)  
Target
Name:
Receptor-type tyrosine-protein kinase FLT3
Synonyms:
CD135 FL cytokine receptor FLK2 FLT3 Fetal liver kinase-2 Fms-like tyrosine kinase 3 (Flt-3) STK-1 Stem cell tyrosine kinase 1
Type:
Enzyme
Mol. Mass.:
112888.62
Organism:
Homo sapiens (Human)
Description:
P36888
Residue:
993
  
Inhibitor
Name:
BDBM50519725
Synonyms:
CHEMBL4513768
Type:
Small organic molecule
Emp. Form.:
C19H24ClN7S
Mol. Mass.:
417.959
SMILES:
Cl.CCN1CCN(CC1)c1cc(Nc2ncc(s2)-c2ccncc2)nc(C)n1
: