Target
Mast/stem cell growth factor receptor Kit
Ligand
BDBM13530
Substrate
Meas. Tech.
ChEMBL_1878177 (CHEMBL4379571)
IC50
53±n/a nM
Citation
 Lin, WHWu, SYYeh, TKChen, CTSong, JSShiao, HYKuo, CCHsu, TLu, CTWang, PCWu, TSPeng, YHLin, HYChen, CPWeng, YLKung, FCWu, MHSu, YCHuang, KWChou, LHHsueh, CCYen, KJKuo, PCHuang, CLChen, LTShih, CTsai, HJJiaang, WT Identification of a Multitargeted Tyrosine Kinase Inhibitor for the Treatment of Gastrointestinal Stromal Tumors and Acute Myeloid Leukemia. J Med Chem 62:11135-11150 (2019)  
Target
Name:
Mast/stem cell growth factor receptor Kit
Synonyms:
CD117 antigen KIT Mast/stem cell growth factor receptor Kit (cKIT) Proto-oncogene tyrosine-protein kinase Kit Stem cell growth factor receptor Tyrosine-protein kinase Kit c-kit v-kit Hardy-Zuckerman 4 feline sarcoma viral oncogene homolog
Type:
Protein
Mol. Mass.:
109869.37
Organism:
Homo sapiens (Human)
Description:
P10721
Residue:
976
  
Inhibitor
Name:
BDBM13530
Synonyms:
4-[(4-methylpiperazin-1-yl)methyl]-N-[4-methyl-3-[(4-pyridin-3-ylpyrimidin-2-yl)amino]phenyl]benzamide Gleevec Imatinib, 21 STI-571 US10906896, Cpd imatinib US11725005, Compound imatinib cid_5291 med.21724, Compound 6
Type:
Small organic molecule
Emp. Form.:
C29H31N7O
Mol. Mass.:
493.6027
SMILES:
CN1CCN(Cc2ccc(cc2)C(=O)Nc2ccc(C)c(Nc3nccc(n3)-c3cccnc3)c2)CC1
: