Target
Mast/stem cell growth factor receptor Kit
Ligand
BDBM4814
Substrate
Meas. Tech.
ChEMBL_1878177 (CHEMBL4379571)
IC50
48±n/a nM
Citation
 Lin, WHWu, SYYeh, TKChen, CTSong, JSShiao, HYKuo, CCHsu, TLu, CTWang, PCWu, TSPeng, YHLin, HYChen, CPWeng, YLKung, FCWu, MHSu, YCHuang, KWChou, LHHsueh, CCYen, KJKuo, PCHuang, CLChen, LTShih, CTsai, HJJiaang, WT Identification of a Multitargeted Tyrosine Kinase Inhibitor for the Treatment of Gastrointestinal Stromal Tumors and Acute Myeloid Leukemia. J Med Chem 62:11135-11150 (2019)  
Target
Name:
Mast/stem cell growth factor receptor Kit
Synonyms:
CD117 antigen KIT Mast/stem cell growth factor receptor Kit (cKIT) Proto-oncogene tyrosine-protein kinase Kit Stem cell growth factor receptor Tyrosine-protein kinase Kit c-kit v-kit Hardy-Zuckerman 4 feline sarcoma viral oncogene homolog
Type:
Protein
Mol. Mass.:
109869.37
Organism:
Homo sapiens (Human)
Description:
P10721
Residue:
976
  
Inhibitor
Name:
BDBM4814
Synonyms:
CHEMBL535 N-[2-(diethylamino)ethyl]-5-{[(3Z)-5-fluoro-2-oxo-2,3-dihydro-1H-indol-3-ylidene]methyl}-2,4-dimethyl-1H-pyrrole-3-carboxamide SUNITINIB US10464902, Sunitinib US9914707, SU11248
Type:
Small organic molecule
Emp. Form.:
C22H27FN4O2
Mol. Mass.:
398.4738
SMILES:
CCN(CC)CCNC(=O)c1c(C)[nH]c(\C=C2/C(=O)Nc3ccc(F)cc23)c1C
: