Target
Stromelysin-1
Ligand
BDBM50073823
Substrate
Meas. Tech.
ChEBML_101942
Ki
62±n/a nM
Citation
 Reiter, LARizzi, JPPandit, JLasut, MJMcGahee, SMParikh, VDBlake, JFDanley, DELaird, ERLopez-Anaya, ALopresti-Morrow, LLMansour, MNMartinelli, GJMitchell, PGOwens, BSPauly, TAReeves, LMSchulte, GKYocum, SA Inhibition of MMP-1 and MMP-13 with phosphinic acids that exploit binding in the S2 pocket. Bioorg Med Chem Lett 9:127-32 (1999)  
Target
Name:
Stromelysin-1
Synonyms:
MMP-3 MMP3_HUMAN Matrix metalloproteinase 3 Matrix metalloproteinase-3 (MMP-3) SL-1 Stromelysin 1 | Transin-1
Type:
Enzyme
Mol. Mass.:
53973.13
Organism:
Homo sapiens (Human)
Description:
P08254
Residue:
477
  
Inhibitor
Name:
BDBM50073823
Synonyms:
CHEMBL24871 | {4-[((S)-1-Acetyl-pyrrolidine-2-carbonyl)-amino]-butyl}-[(S)-2-((R)-3-methyl-1-phenylcarbamoyl-butylcarbamoyl)-4-phenyl-butyl]-phosphinic acid
Type:
Small organic molecule
Emp. Form.:
C34H49N4O6P
Mol. Mass.:
640.7498
SMILES:
CC(C)C[C@@H](NC(=O)[C@H](CCc1ccccc1)CP(O)(=O)CCCCNC(=O)[C@@H]1CCCN1C(C)=O)C(=O)Nc1ccccc1
: