Target
WD repeat-containing protein 5
Ligand
BDBM50520121
Substrate
Meas. Tech.
ChEMBL_1879085 (CHEMBL4380479)
Ki
0.044000±n/a nM
Citation
 Tian, JTeuscher, KBAho, ERAlvarado, JRMills, JJMeyers, KMGogliotti, RDHan, CMacdonald, JDSai, JShaw, JGSensintaffar, JLZhao, BRietz, TAThomas, LRPayne, WGMoore, WJStott, GMKondo, JInoue, MCoffey, RJTansey, WPStauffer, SRLee, TFesik, SW Discovery and Structure-Based Optimization of Potent and Selective WD Repeat Domain 5 (WDR5) Inhibitors Containing a Dihydroisoquinolinone Bicyclic Core. J Med Chem 63:656-675 (2020)  
Target
Name:
WD repeat-containing protein 5
Synonyms:
BIG3 WD repeat-containing protein 5 (WDR5) WDR5 | WDR5_HUMAN
Type:
Protein
Mol. Mass.:
36597.13
Organism:
Homo sapiens (Human)
Description:
P61964
Residue:
334
  
Inhibitor
Name:
BDBM50520121
Synonyms:
CHEMBL4441671 | US10844044, Example 1
Type:
Small organic molecule
Emp. Form.:
C25H22Cl2FN5O
Mol. Mass.:
498.379
SMILES:
Cc1nc(F)ccc1-c1cc(Cn2ccn(C)c2=N)cc(c1)C(=O)NCc1ccc(Cl)c(Cl)c1
: