Target
Ribosomal protein S6 kinase alpha-6
Ligand
BDBM50520165
Substrate
Meas. Tech.
ChEMBL_1879131 (CHEMBL4380525)
IC50
1260±n/a nM
Citation
 Lefranc, JSchulze, VKHillig, RCBriem, HPrinz, FMengel, AHeinrich, TBalint, JRengachari, SIrlbacher, HStöckigt, DBömer, UBader, BGradl, SNNising, CFvon Nussbaum, FMumberg, DPanne, DWengner, AM Discovery of BAY-985, a Highly Selective TBK1/IKK? Inhibitor. J Med Chem 63:601-612 (2020)  
Target
Name:
Ribosomal protein S6 kinase alpha-6
Synonyms:
90 kDa ribosomal protein S6 kinase 6 RPS6KA6 RPS6KA6(Kin.Dom.2 - C-terminal) RSK4 Ribosomal S6 kinase 4 Ribosomal protein S6 kinase alpha 6 (RSK4) S6K-alpha 6 p90RSK | pp90RSK4
Type:
Serine/threonine-protein kinase
Mol. Mass.:
83868.06
Organism:
Homo sapiens (Human)
Description:
Residue:
745
  
Inhibitor
Name:
BDBM50520165
Synonyms:
CHEMBL4454902
Type:
Small organic molecule
Emp. Form.:
C29H31F3N8O2
Mol. Mass.:
580.604
SMILES:
C[C@@H](N1CCN(CC1)C(=O)CC(F)(F)F)c1ccnc(Nc2nc3ccc(cc3[nH]2)-c2cc(OCC3CC3)ncn2)c1
: