Target
Orexin receptor type 2
Ligand
BDBM154947
Substrate
Meas. Tech.
ChEMBL_1879203 (CHEMBL4380597)
Ki
0.630957±n/a nM
Citation
 Rappas, MAli, AAEBennett, KABrown, JDBucknell, SJCongreve, MCooke, RMCseke, Gde Graaf, CDoré, ASErrey, JCJazayeri, AMarshall, FHMason, JSMould, RPatel, JCTehan, BGWeir, MChristopher, JA Comparison of Orexin 1 and Orexin 2 Ligand Binding Modes Using X-ray Crystallography and Computational Analysis. J Med Chem 63:1528-1543 (2020)  
Target
Name:
Orexin receptor type 2
Synonyms:
HCRTR2 OX2R_HUMAN Orexin receptor type 2 (OR-2) Orexin receptor type 2 (OX2R) Ox-2-R | Ox2-R
Type:
Protein
Mol. Mass.:
50710.53
Organism:
Homo sapiens (Human)
Description:
O43614
Residue:
444
  
Inhibitor
Name:
BDBM154947
Synonyms:
US9000029, 26
Type:
Small organic molecule
Emp. Form.:
C20H24N2O4S
Mol. Mass.:
388.481
SMILES:
COc1ccc(cc1)S(=O)(=O)N1CCC[C@H]1C(=O)Nc1cc(C)cc(C)c1
: