Target
5-hydroxytryptamine receptor 1D
Ligand
BDBM50074171
Substrate
Meas. Tech.
ChEMBL_1701 (CHEMBL616908)
IC50
0.35±n/a nM
Citation
 Sternfeld, FGuiblin, ARJelley, RAMatassa, VGReeve, AJHunt, PABeer, MSHeald, AStanton, JASohal, BWatt, APStreet, LJ Synthesis and serotonergic activity of 3-[2-(pyrrolidin-1-yl)ethyl]indoles: potent agonists for the h5-HT1D receptor with high selectivity over the h5-HT1B receptor. J Med Chem 42:677-90 (1999)  
Target
Name:
5-hydroxytryptamine receptor 1D
Synonyms:
5-HT-1D 5-HT1D 5HT1D_HUMAN HTR1DA Serotonin (5-HT) receptor | Serotonin Receptor 1D
Type:
G Protein-Coupled Receptor (GPCR)
Mol. Mass.:
41920.63
Organism:
Homo sapiens (Human)
Description:
Receptor binding assays were performed using human clone stably expressed in CHO cells.
Residue:
377
  
Inhibitor
Name:
BDBM50074171
Synonyms:
(S)-4-(3-{2-[(S)-3-(Benzylamino-methyl)-pyrrolidin-1-yl]-ethyl}-1H-indol-5-ylmethyl)-oxazolidin-2-one | CHEMBL159483
Type:
Small organic molecule
Emp. Form.:
C26H32N4O2
Mol. Mass.:
432.5579
SMILES:
O=C1N[C@@H](Cc2ccc3[nH]cc(CCN4CC[C@@H](CNCc5ccccc5)C4)c3c2)CO1
: