Target
5-hydroxytryptamine receptor 1D
Ligand
BDBM50074189
Substrate
Meas. Tech.
ChEMBL_1680 (CHEMBL617040)
EC50
1±n/a nM
Citation
 Chambers, MSStreet, LJGoodacre, SHobbs, SCHunt, PJelley, RAMatassa, VGReeve, AJSternfeld, FBeer, MSStanton, JARathbone, DWatt, APMacLeod, AM 3-(Piperazinylpropyl)indoles: selective, orally bioavailable h5-HT1D receptor agonists as potential antimigraine agents. J Med Chem 42:691-705 (1999)  
Target
Name:
5-hydroxytryptamine receptor 1D
Synonyms:
5-HT-1D 5-HT1D 5HT1D_HUMAN HTR1DA Serotonin (5-HT) receptor | Serotonin Receptor 1D
Type:
G Protein-Coupled Receptor (GPCR)
Mol. Mass.:
41920.63
Organism:
Homo sapiens (Human)
Description:
Receptor binding assays were performed using human clone stably expressed in CHO cells.
Residue:
377
  
Inhibitor
Name:
BDBM50074189
Synonyms:
3-[3-(4-Pyridin-4-ylmethyl-piperazin-1-yl)-propyl]-5-[1,2,4]triazol-4-yl-1H-indole | CHEMBL162858
Type:
Small organic molecule
Emp. Form.:
C23H27N7
Mol. Mass.:
401.5074
SMILES:
C(CN1CCN(Cc2ccncc2)CC1)Cc1c[nH]c2ccc(cc12)-n1cnnc1
: