Target
Acetylcholine-binding protein
Ligand
BDBM50520724
Substrate
Meas. Tech.
ChEMBL_1881879 (CHEMBL4383378)
Ki
72±n/a nM
Citation
 Yang, XShen, JJiang, LLi, WYu, MPan, GYan, YZhang, CJia, WXiao, LYu, HChen, HZheng, YYu, LXie, QZhou, LShao, L Discovery, cocrystallization and biological evaluation of novel piperidine derivatives as high affinity Ls-AChBP ligands possessing ?7 nAChR activities. Eur J Med Chem 160:37-48 (2018)  
Target
Name:
Acetylcholine-binding protein
Synonyms:
ACHP_LYMST Acetylcholine Binding protein Acetylcholine-binding protein (Ls-AchBP) | AchBP
Type:
Mol. Mass.:
26055.52
Organism:
Lymnaea stagnalis
Description:
Soluble acetylcholine receptor
Residue:
229
  
Inhibitor
Name:
BDBM50520724
Synonyms:
CHEMBL4559828
Type:
Small organic molecule
Emp. Form.:
C18H20Cl2N2O
Mol. Mass.:
351.27
SMILES:
Clc1ccc(CC2(COc3cccnc3)CCNCC2)cc1Cl
: