Target
Somatostatin receptor type 2
Ligand
BDBM50075286
Substrate
Meas. Tech.
ChEBML_200682
Ki
2.2±n/a nM
Citation
 Pasternak, APan, YMarino, DSanderson, PEMosley, RRohrer, SPBirzin, ETHuskey, SEJacks, TSchleim, KDCheng, KSchaeffer, JMPatchett, AAYang, L Potent, orally bioavailable somatostatin agonists: good absorption achieved by urea backbone cyclization. Bioorg Med Chem Lett 9:491-6 (1999)  
Target
Name:
Somatostatin receptor type 2
Synonyms:
SOMATOSTATIN SST2 SS-2-R SS2R SSTR2 | Somatostatin receptor type 2 (SSTR2)
Type:
Enzyme
Mol. Mass.:
41344.94
Organism:
Homo sapiens (Human)
Description:
P30874
Residue:
369
  
Inhibitor
Name:
BDBM50075286
Synonyms:
(R)-6-Amino-2-{(2R,3S)-3-(1H-indol-3-yl)-2-[3-methyl-3-(3-phenyl-propyl)-ureido]-butyrylamino}-hexanoic acid tert-butyl ester | CHEMBL147711
Type:
Small organic molecule
Emp. Form.:
C33H47N5O4
Mol. Mass.:
577.7574
SMILES:
C[C@H]([C@@H](NC(=O)N(C)CCCc1ccccc1)C(=O)N[C@H](CCCCN)C(=O)OC(C)(C)C)c1c[nH]c2ccccc12
: