Target
Retinoic acid receptor alpha
Ligand
BDBM50075876
Substrate
Meas. Tech.
ChEBML_225937
IC50
6.5±n/a nM
Citation
 Vuligonda, VStandeven, AMEscobar, MChandraratna, RA A new class of potent RAR antagonists: dihydroanthracenyl, benzochromenyl and benzothiochromenyl retinoids. Bioorg Med Chem Lett 9:743-8 (1999)  
Target
Name:
Retinoic acid receptor alpha
Synonyms:
NR1B1 RAR-alpha RARA_HUMAN Retinoic acid receptor alpha/Retinoid X receptor alpha Retinoid receptor
Type:
PROTEIN
Mol. Mass.:
50778.87
Organism:
Homo sapiens (Human)
Description:
ChEMBL_1466191
Residue:
462
  
Inhibitor
Name:
BDBM50075876
Synonyms:
4-[2,2-Dimethyl-4-(5-methyl-thiophen-2-yl)-2H-benzo[g]chromen-7-yl]-benzoic acid | CHEMBL163530
Type:
Small organic molecule
Emp. Form.:
C27H22O3S
Mol. Mass.:
426.527
SMILES:
Cc1ccc(s1)C1=CC(C)(C)Oc2cc3ccc(cc3cc12)-c1ccc(cc1)C(O)=O
: