Target
Epidermal growth factor receptor
Ligand
BDBM377836
Substrate
Meas. Tech.
ChEMBL_1883986 (CHEMBL4385485)
IC50
15±n/a nM
Citation
 Schnute, MEBenoit, SEBuchler, IPCaspers, NGrapperhaus, MLHan, SHotchandani, RHuang, NHughes, ROJuba, BMKim, KHLiu, EMcCarthy, EMessing, DMiyashiro, JSMohan, SO'Connell, TNOhren, JFParikh, MDSchmidt, MSelness, SRSpringer, JRThanabal, VTrujillo, JIWalker, DPWan, ZKWithka, JMWittwer, AJWood, NLXing, LZapf, CWDouhan, J Aminopyrazole Carboxamide Bruton's Tyrosine Kinase Inhibitors. Irreversible to Reversible Covalent Reactive Group Tuning. ACS Med Chem Lett 10:80-85 (2019)  
Target
Name:
Epidermal growth factor receptor
Synonyms:
EGF Receptor Substrate EGFR_HUMAN ERBB1 Epidermal Growth Factor Receptor erbB-1 Epidermal growth factor receptor (EGFR) HER1 Proto-oncogene c-ErbB-1 Tyrosine-Protein Kinase ErbB-1
Type:
Receptor Kinase Domain
Mol. Mass.:
134279.59
Organism:
Homo sapiens (Human)
Description:
P00533
Residue:
1210
  
Inhibitor
Name:
BDBM377836
Synonyms:
1-[(3R)-1-acryloyl piperidin-3-yl]-5-amino-3-[4-(4-chlorophenoxy)phenyl]-1H-pyrazole-4-carboxamide | US10266513, Example 130
Type:
Small organic molecule
Emp. Form.:
C24H24ClN5O3
Mol. Mass.:
465.932
SMILES:
NC(=O)c1c(N)n(nc1-c1ccc(Oc2ccc(Cl)cc2)cc1)[C@@H]1CCCN(C1)C(=O)C=C
: