Target
Cathepsin D
Ligand
BDBM50076291
Substrate
Meas. Tech.
ChEMBL_45175 (CHEMBL662660)
Ki
5.8±n/a nM
Citation
 Haque, TSSkillman, AGLee, CEHabashita, HGluzman, IYEwing, TJGoldberg, DEKuntz, IDEllman, JA Potent, low-molecular-weight non-peptide inhibitors of malarial aspartyl protease plasmepsin II. J Med Chem 42:1428-40 (1999)  
Target
Name:
Cathepsin D
Synonyms:
CATD_HUMAN CTSD Cathepsin D heavy chain Cathepsin D precursor
Type:
Enzyme
Mol. Mass.:
44551.72
Organism:
Homo sapiens (Human)
Description:
Human proCathepsin D (SwissProt accession number P07339) was expressed in Sf9 cells, purified, and autoactivated.
Residue:
412
  
Inhibitor
Name:
BDBM50076291
Synonyms:
1-Methyl-piperidine-4-carboxylic acid (2-benzo[1,3]dioxol-5-yl-ethyl)-{(2S,3S)-3-[2-(3-chloro-phenoxy)-acetylamino]-2-hydroxy-4-phenyl-butyl}-amide | CHEMBL285133
Type:
Small organic molecule
Emp. Form.:
C34H40ClN3O6
Mol. Mass.:
622.151
SMILES:
CN1CCC(CC1)C(=O)N(CCc1ccc2OCOc2c1)C[C@H](O)[C@H](Cc1ccccc1)NC(=O)COc1cccc(Cl)c1
: