Target
Tyrosyl-DNA phosphodiesterase 2
Ligand
BDBM50521678
Substrate
Meas. Tech.
ChEMBL_1884986 (CHEMBL4386568)
IC50
38±n/a nM
Citation
 Kankanala, JRibeiro, CJAKiselev, ERavji, AWilliams, JXie, JAihara, HPommier, YWang, Z Novel Deazaflavin Analogues Potently Inhibited Tyrosyl DNA Phosphodiesterase 2 (TDP2) and Strongly Sensitized Cancer Cells toward Treatment with Topoisomerase II (TOP2) Poison Etoposide. J Med Chem 62:4669-4682 (2019)  
Target
Name:
Tyrosyl-DNA phosphodiesterase 2
Synonyms:
EAP2 ETS1-associated protein 2 TDP2 TTRAP Tyr-DNA phosphodiesterase 2 Tyrosyl-DNA phosphodiesterase 2 (hTDP2) VPg unlinkase | hTDP2
Type:
Enzyme Catalytic Domain
Mol. Mass.:
40916.54
Organism:
Homo sapiens (Human)
Description:
gi_23510348
Residue:
362
  
Inhibitor
Name:
BDBM50521678
Synonyms:
CHEMBL4521151
Type:
Small organic molecule
Emp. Form.:
C26H16N4O5
Mol. Mass.:
464.429
SMILES:
COC(=O)c1cccc(c1)-n1c(=O)nc2n(-c3ccc(O)cc3)c3cc(ccc3cc2c1=O)C#N
: