Target
Tyrosyl-DNA phosphodiesterase 2
Ligand
BDBM50521699
Substrate
Meas. Tech.
ChEMBL_1884986 (CHEMBL4386568)
IC50
6.5±n/a nM
Citation
 Kankanala, JRibeiro, CJAKiselev, ERavji, AWilliams, JXie, JAihara, HPommier, YWang, Z Novel Deazaflavin Analogues Potently Inhibited Tyrosyl DNA Phosphodiesterase 2 (TDP2) and Strongly Sensitized Cancer Cells toward Treatment with Topoisomerase II (TOP2) Poison Etoposide. J Med Chem 62:4669-4682 (2019)  
Target
Name:
Tyrosyl-DNA phosphodiesterase 2
Synonyms:
EAP2 ETS1-associated protein 2 TDP2 TTRAP Tyr-DNA phosphodiesterase 2 Tyrosyl-DNA phosphodiesterase 2 (hTDP2) VPg unlinkase | hTDP2
Type:
Enzyme Catalytic Domain
Mol. Mass.:
40916.54
Organism:
Homo sapiens (Human)
Description:
gi_23510348
Residue:
362
  
Inhibitor
Name:
BDBM50521699
Synonyms:
CHEMBL4572376
Type:
Small organic molecule
Emp. Form.:
C25H16ClN5O4S
Mol. Mass.:
517.944
SMILES:
CS(=O)(=O)Nc1ccc(cc1)-n1c2cc(ccc2cc2c1nc(=O)n(-c1ccc(Cl)cc1)c2=O)C#N
: