Target
Lysosomal alpha-glucosidase
Ligand
BDBM50076963
Substrate
Meas. Tech.
ChEMBL_216946 (CHEMBL822915)
pH
6.55±n/a
Ki
54000±n/a nM
Comments
extracted
Citation
 Hines, JVChang, HGerdeman, MSWarn, DE Isotope edited NMR studies of glycosidases: design and synthesis of a novel glycosidase inhibitor. Bioorg Med Chem Lett 9:1255-60 (1999)  
Target
Name:
Lysosomal alpha-glucosidase
Synonyms:
70 kDa lysosomal alpha-glucosidase Acid maltase Alpha glucosidase LYAG_HUMAN
Type:
PROTEIN
Mol. Mass.:
105312.45
Organism:
Homo sapiens (Human)
Description:
ChEMBL_1506060
Residue:
952
  
Inhibitor
Name:
BDBM50076963
Synonyms:
(3R,5R)-2-Hydroxymethyl-1-methyl-piperidine-3,4,5-triol CHEMBL418746
Type:
Small organic molecule
Emp. Form.:
C7H15NO4
Mol. Mass.:
177.1983
SMILES:
CN1CC(O)C(O)C(O)C1CO
: