Target
Cytochrome P450 3A4
Ligand
BDBM45440
Substrate
Meas. Tech.
ChEMBL_1886565 (CHEMBL4388242)
IC50
>25000±n/a nM
Citation
 Linciano, PPozzi, CIacono, LDdi Pisa, FLandi, GBonucci, AGul, SKuzikov, MEllinger, BWitt, GSantarem, NBaptista, CFranco, CMoraes, CBMüller, WWittig, ULuciani, RSesenna, AQuotadamo, AFerrari, SPöhner, ICordeiro-da-Silva, AMangani, SCostantino, LCosti, MP Enhancement of Benzothiazoles as Pteridine Reductase-1 Inhibitors for the Treatment of Trypanosomatidic Infections. J Med Chem 62:3989-4012 (2019)  
Target
Name:
Cytochrome P450 3A4
Synonyms:
Albendazole monooxygenase CP3A4_HUMAN CYP3A4 CYPIIIA4 Cytochrome P450 3A4 (CYP3A4) Nifedipine oxidase Taurochenodeoxycholate 6-alpha-hydroxylase
Type:
Enzyme
Mol. Mass.:
57349.57
Organism:
Homo sapiens (Human)
Description:
Residue:
503
  
Inhibitor
Name:
BDBM45440
Synonyms:
4-[5-(4-amidinophenoxy)pentoxy]benzamidine;2-hydroxyethanesulfonic acid 4-[5-(4-carbamimidoylphenoxy)pentoxy]benzenecarboximidamide;2-oxidanylethanesulfonic acid MLS000028738 PENTAMIDINE ISETHIONATE cid_359323
Type:
Small organic molecule
Emp. Form.:
C19H24N4O2
Mol. Mass.:
340.4195
SMILES:
NC(=N)c1ccc(OCCCCCOc2ccc(cc2)C(N)=N)cc1
: