Target
Cytochrome P450 2C9
Ligand
BDBM45440
Substrate
Meas. Tech.
ChEMBL_1886562 (CHEMBL4388239)
IC50
>25000±n/a nM
Citation
 Linciano, PPozzi, CIacono, LDdi Pisa, FLandi, GBonucci, AGul, SKuzikov, MEllinger, BWitt, GSantarem, NBaptista, CFranco, CMoraes, CBMüller, WWittig, ULuciani, RSesenna, AQuotadamo, AFerrari, SPöhner, ICordeiro-da-Silva, AMangani, SCostantino, LCosti, MP Enhancement of Benzothiazoles as Pteridine Reductase-1 Inhibitors for the Treatment of Trypanosomatidic Infections. J Med Chem 62:3989-4012 (2019)  
Target
Name:
Cytochrome P450 2C9
Synonyms:
(R)-limonene 6-monooxygenase CP2C9_HUMAN CYP2C9 Cytochrome P450 2C9 (CYP2C9 ) P-450MP P450 PB-1 | S-mephenytoin 4-hydroxylase
Type:
Enzyme
Mol. Mass.:
55636.33
Organism:
Homo sapiens (Human)
Description:
P11712
Residue:
490
  
Inhibitor
Name:
BDBM45440
Synonyms:
4-[5-(4-amidinophenoxy)pentoxy]benzamidine;2-hydroxyethanesulfonic acid 4-[5-(4-carbamimidoylphenoxy)pentoxy]benzenecarboximidamide;2-oxidanylethanesulfonic acid MLS000028738 PENTAMIDINE ISETHIONATE cid_359323
Type:
Small organic molecule
Emp. Form.:
C19H24N4O2
Mol. Mass.:
340.4195
SMILES:
NC(=N)c1ccc(OCCCCCOc2ccc(cc2)C(N)=N)cc1
: