Target
60 kDa heat shock protein, mitochondrial
Ligand
BDBM50522596
Substrate
Meas. Tech.
ChEMBL_1886967 (CHEMBL4388644)
IC50
9000±n/a nM
Citation
 Washburn, AAbdeen, SOvechkina, YRay, AMStevens, MChitre, SSivinski, JPark, YJohnson, JHoang, QQChapman, EParish, TJohnson, SM Dual-targeting GroEL/ES chaperonin and protein tyrosine phosphatase B (PtpB) inhibitors: A polypharmacology strategy for treating Mycobacterium tuberculosis infections. Bioorg Med Chem Lett 29:1665-1672 (2019)  
Target
Name:
60 kDa heat shock protein, mitochondrial
Synonyms:
3.6.4.9 60 kDa heat shock protein, mitochondrial CPN60 HSP-60 HSP60/HSP10 Heat shock protein 60 Mitochondrial matrix protein P1 | P60 lymphocyte protein
Type:
PROTEIN
Mol. Mass.:
61050.41
Organism:
Homo sapiens
Description:
ChEMBL_117701
Residue:
573
  
Inhibitor
Name:
BDBM50522596
Synonyms:
CHEMBL4437169
Type:
Small organic molecule
Emp. Form.:
C23H16ClN3O5S3
Mol. Mass.:
546.038
SMILES:
Clc1ccc(s1)S(=O)(=O)Nc1ccc(cc1)-c1nc2cc(NS(=O)(=O)c3ccccc3)ccc2o1
: