Target
5'-nucleotidase
Ligand
BDBM50523523
Substrate
Meas. Tech.
ChEMBL_1890511 (CHEMBL4392265)
Ki
262±n/a nM
Citation
 Junker, ARenn, CDobelmann, CNamasivayam, VJain, SLosenkova, KIrjala, HDuca, SBalasubramanian, RChakraborty, SBörgel, FZimmermann, HYegutkin, GGMüller, CEJacobson, KA Structure-Activity Relationship of Purine and Pyrimidine Nucleotides as Ecto-5'-Nucleotidase (CD73) Inhibitors. J Med Chem 62:3677-3695 (2019)  
Target
Name:
5'-nucleotidase
Synonyms:
5'-nucleotidase Ecto-5'-nucleotidase (e5'NT) NT Nt5e | Nte
Type:
Enzyme
Mol. Mass.:
63971.44
Organism:
Rattus norvegicus (Rat)
Description:
P21588
Residue:
576
  
Inhibitor
Name:
BDBM50523523
Synonyms:
CHEMBL4440236
Type:
Small organic molecule
Emp. Form.:
C19H27N3O11P2
Mol. Mass.:
535.3787
SMILES:
CCn1c(=O)n(cc\c1=N/OCc1ccccc1)[C@@H]1O[C@H](COP(O)(=O)CP(O)(O)=O)[C@@H](O)[C@H]1O
: