Target
Protein arginine N-methyltransferase 5
Ligand
BDBM50523649
Substrate
Meas. Tech.
ChEMBL_1890800 (CHEMBL4392554)
IC50
1.000000±n/a nM
Citation
 Lin, HLuengo, JI Nucleoside protein arginine methyltransferase 5 (PRMT5) inhibitors. Bioorg Med Chem Lett 29:1264-1269 (2019)  
Target
Name:
Protein arginine N-methyltransferase 5
Synonyms:
72 kDa ICln-binding protein HRMT1L5 IBP72 Jak-binding protein 1 PRMT5/MEP50 complex Protein arginine methyltransferase 5 (PRMT5) SKB1 homolog Shk1 kinase-binding protein 1 homolog
Type:
Enzyme
Mol. Mass.:
72679.99
Organism:
Homo sapiens (Human)
Description:
O14744
Residue:
637
  
Inhibitor
Name:
BDBM50523649
Synonyms:
CHEMBL4448266 | US10709709, Example 198
Type:
Small organic molecule
Emp. Form.:
C22H25FN4O4
Mol. Mass.:
428.4567
SMILES:
COc1cc(O[C@H]2C[C@H]([C@H](O)[C@@H]2O)n2ccc3c(C)ncnc23)c2CNCCc2c1F
: