Target
60 kDa heat shock protein, mitochondrial
Ligand
BDBM23223
Substrate
Meas. Tech.
ChEMBL_1891106 (CHEMBL4392933)
IC50
1200±n/a nM
Citation
 Stevens, MAbdeen, SSalim, NRay, AMWashburn, AChitre, SSivinski, JPark, YHoang, QQChapman, EJohnson, SM HSP60/10 chaperonin systems are inhibited by a variety of approved drugs, natural products, and known bioactive molecules. Bioorg Med Chem Lett 29:1106-1112 (2019)  
Target
Name:
60 kDa heat shock protein, mitochondrial
Synonyms:
3.6.4.9 60 kDa heat shock protein, mitochondrial CPN60 HSP-60 HSP60/HSP10 Heat shock protein 60 Mitochondrial matrix protein P1 | P60 lymphocyte protein
Type:
PROTEIN
Mol. Mass.:
61050.41
Organism:
Homo sapiens
Description:
ChEMBL_117701
Residue:
573
  
Inhibitor
Name:
BDBM23223
Synonyms:
7-[8-formyl-1,6,7-trihydroxy-3-methyl-5-(propan-2-yl)naphthalen-2-yl]-2,3,8-trihydroxy-6-methyl-4-(propan-2-yl)naphthalene-1-carbaldehyde Gossypol Gossypol, 4 Tash 1 cid_3503
Type:
Small organic molecule
Emp. Form.:
C30H30O8
Mol. Mass.:
518.5544
SMILES:
CC(C)c1c(O)c(O)c(C=O)c2c(O)c(c(C)cc12)-c1c(C)cc2c(C(C)C)c(O)c(O)c(C=O)c2c1O
: