Target
60 kDa heat shock protein, mitochondrial
Ligand
BDBM50285551
Substrate
Meas. Tech.
ChEMBL_1891106 (CHEMBL4392933)
IC50
4000±n/a nM
Citation
 Stevens, MAbdeen, SSalim, NRay, AMWashburn, AChitre, SSivinski, JPark, YHoang, QQChapman, EJohnson, SM HSP60/10 chaperonin systems are inhibited by a variety of approved drugs, natural products, and known bioactive molecules. Bioorg Med Chem Lett 29:1106-1112 (2019)  
Target
Name:
60 kDa heat shock protein, mitochondrial
Synonyms:
3.6.4.9 60 kDa heat shock protein, mitochondrial CPN60 HSP-60 HSP60/HSP10 Heat shock protein 60 Mitochondrial matrix protein P1 | P60 lymphocyte protein
Type:
PROTEIN
Mol. Mass.:
61050.41
Organism:
Homo sapiens
Description:
ChEMBL_117701
Residue:
573
  
Inhibitor
Name:
BDBM50285551
Synonyms:
3-Carboxy-2-hexadecyl-3-hydroxy-pentanedioic acid CHEMBL78764
Type:
Small organic molecule
Emp. Form.:
C22H40O7
Mol. Mass.:
416.5488
SMILES:
CCCCCCCCCCCCCCCCC(C(O)=O)C(O)(CC(O)=O)C(O)=O
: